BDBM50176030 3-[4-(2,3-Dihydro-benzo[1,4]dioxin-5-yl)-piperazin-1-ylmethyl]-1H-indole::CHEMBL195015
SMILES C(N1CCN(CC1)c1cccc2OCCOc12)c1c[nH]c2ccccc12
InChI Key InChIKey=UVQHGCKWFYZHSI-UHFFFAOYSA-N
Data  2 KI
  Tab Delimited (TSV)   2D SDfile   Computed 3D by Vconf -m prep SDfile
Find this compound or compounds like it in BindingDB:
Activity Spreadsheet -- Enzyme Inhibition Constant Data from BindingDB
Found 1 hit for monomerid = 50176030
TargetD(2) dopamine receptor(Homo sapiens (Human))
Solvay Pharma
Curated by ChEMBL
LigandPNGBDBM50176030(3-[4-(2,3-Dihydro-benzo[1,4]dioxin-5-yl)-piperazin...)
Affinity DataKi:  62nM. Assay description: In vitro inhibitory constant against [3H]-spiperone binding to human dopamine D2 receptor expressed in CHO cells
In DepthDetails ArticlePubMed